WORK IN PROGRESS, some pages may not display correctly

Building status

src-testing-5.11.3                                                             2019-08-21 01:02:45
 
./configure -silent -accept-license -skip-qt-check -sourcedir /geopsy/build/sources/devtools/testing-5.11.3 -dest-prefix /geopsy/build/sources/devtools/testing-5.11.3/dest -prefix /geopsy/build/sources/devtools/testing-5.11.3/install -buildsubdir devpro -distribution geopsypack-3.0.0
/bin/bash: configure: No such file or directory


#######################################################
An error occured and there were unfinished tasks
To finish this task, please launch the same task again
#######################################################

[Summary] Failed to build compile tools !!!
[Summary] #### Leaving src-testing-5.11.3 ####
src-devel-5.11.3                                                             2019-08-21 01:02:45
 
Do you accept these license? 
Configure QGpCoreTools
Configure QGpGuiTools
Configure GeopsyLand
Configure QGpCoreMath
Configure SciFigs
Configure QGpGuiMath
Configure mseed
bash: configure: No such file or directory
[Summary] #### Leaving src-devel-5.11.3 ####
win64-testing-5.12.3                                                             2019-08-20 17:06:44
 
                 from src/SignalFileFormat.cpp:35:
c:/Geopsy/factory/win64-testing-5.12.3/3rdparty/mseed/src/mseed.h:2:10: fatal error: mseed/libmseed.h: No such file or directory
 #include "mseed/libmseed.h"
          ^~~~~~~~~~~~~~~~~~
compilation terminated.
make[2]: *** [Makefile.Release:27604: release/SignalFileFormat.o] Error 1
make[2]: Leaving directory 'C:/Geopsy/factory/win64-testing-5.12.3/geopsy/GeopsyCore'
make[1]: *** [Makefile:38: release] Error 2
make[1]: Leaving directory 'C:/Geopsy/factory/win64-testing-5.12.3/geopsy/GeopsyCore'
make: *** [Makefile:645: sub-geopsy-GeopsyCore-make_first-ordered] Error 2
[Summary] #### Leaving win64-testing-5.12.3 ####
win64-devel-5.12.3                                                             2019-08-20 17:06:44
 
./configure-devel -silent -accept-license -skip-qt-check -sourcedir /c/Geopsy/factory/devtools/devel-5.12.3 -dest-prefix /c/Geopsy/factory/devtools/devel-5.12.3/dest -prefix /c/Geopsy/factory/devtools/devel-5.12.3/install -buildsubdir devpro -distribution geopsypack-0.0.0-snapshot-20190521
/bin/bash: ./configure-devel: No such file or directory


#######################################################
An error occured and there were unfinished tasks
To finish this task, please launch the same task again
#######################################################

[Summary] Failed to build compile tools !!!
[Summary] #### Leaving win64-devel-5.12.3 ####

Building details

Linux: summary details

Mac3: summary details

Windows: summary details

View all log files

Versions

version status

Man pages and API documentation

man log

api log